{"text_format":"1","workbook":"xlsx","n_sheets":6,"sheets":["テストデータ","成績表","科目別テスト集計","模試・実力テスト集計","連続印刷","初期設定"],"not_rendered":{"charts":12,"images":1,"macros":1,"external_links":0,"defined_names":3,"comments":0,"pivot_tables":0},"unopened":[],"bounds":{"document_bytes":16777216,"sheet_cells":100000,"rows_first":2000,"rows_last":500,"rows_between":2000,"halvings":0,"cell_chars":16384,"cell_head_chars":4096},"cells_cut":0,"cells_raw":0,"read":"whole","date_system":"1900"}

{"sheet":"テストデータ","index":0,"n_rows":503,"n_cols":136,"rows_kept":503,"cut":false,"hidden":false,"merged":[[2,15,2,26],[0,3,0,14],[0,15,0,26],[0,27,0,38],[0,39,0,50],[2,3,2,14],[2,27,2,38],[2,39,2,50],[1,99,1,110],[1,111,1,122],[1,123,1,134],[0,99,0,103],[0,104,0,110],[0,111,0,115],[0,116,0,122],[0,123,0,127],[0,128,0,134],[2,51,2,62],[0,51,0,62],[1,63,1,74],[1,75,1,86],[1,87,1,98],[0,63,0,67],[0,68,0,74],[0,75,0,79],[0,80,0,86],[0,87,0,91],[0,92,0,98]]}
["ｶｰｿﾙ方向切り替え",null,null,{"$f":"IF(初期設定!$C2=\"\",\"\",初期設定!$C2)","v":"月例テスト"},null,null,null,null,null,null,null,null,null,null,null,{"$f":"IF(初期設定!$C2=\"\",\"\",初期設定!$C2)","v":"月例テスト"},null,null,null,null,null,null,null,null,null,null,null,{"$f":"IF(初期設定!$C2=\"\",\"\",初期設定!$C2)","v":"月例テスト"},null,null,null,null,null,null,null,null,null,null,null,{"$f":"IF(初期設定!$C2=\"\",\"\",初期設定!$C2)","v":"月例テスト"},null,null,null,null,null,null,null,null,null,null,null,{"$f":"IF(初期設定!$C2=\"\",\"\",初期設定!$C2)","v":"月例テスト"}]
[null,null,"実施日→","3/2","4/3","5/4","6/5","7/6","8/7","9/8","10/9","11/10","12/11",null,null,"4/8","5/8","6/8","7/8","8/8","9/8","10/8","11/8","12/8","1/8",null,null,"4/9","5/12","6/15","7/18","8/5","9/7","10/11","11/30","12/2","1/9",null,null,"4/5","5/2","6/5","7/18","8/5","9/7","10/5","11/30","12/4","1/9",null,null,"4/5","5/2","6/4","7/18","8/10","9/7","10/5","11/21","12/4","1/25",null,null,"4/1",null,null,null,null,null,null,null,null,null,null,null,"5/1",null,null,null,null,null,null,null,null,null,null,null,"7/1",null,null,null,null,null,null,null,null,null,null,null,"9/1",null,null,null,null,null,null,null,null,null,null,null,"11/1",null,null,null,null,null,null,null,null,null,null,null,"1/15"]
["ID","class","氏名",{"$f":"IF(初期設定!$C3=\"\",\"\",初期設定!$C3)","v":"国語"},null,null,null,null,null,null,null,null,null,null,null,{"$f":"IF(初期設定!$C4=\"\",\"\",初期設定!$C4)","v":"算数"},null,null,null,null,null,null,null,null,null,null,null,{"$f":"IF(初期設定!$C5=\"\",\"\",初期設定!$C5)","v":"理科"},null,null,null,null,null,null,null,null,null,null,null,{"$f":"IF(初期設定!$C6=\"\",\"\",初期設定!$C6)","v":"社会"},null,null,null,null,null,null,null,null,null,null,null,{"$f":"IF(初期設定!$C7=\"\",\"\",初期設定!$C7)","v":"英語"},null,null,null,null,null,null,null,null,null,null,null,{"$f":"IF(初期設定!$C9=\"\",\"\",初期設定!$C9)","v":"国語"},{"$f":"IF(BL3=\"\",\"\",MID(BL3,1,1)&\"偏\")","v":"国偏"},{"$f":"IF(初期設定!$C10=\"\",\"\",初期設定!$C10)","v":"算数"},{"$f":"IF(BN3=\"\",\"\",MID(BN3,1,1)&\"偏\")","v":"算偏"},{"$f":"IF(初期設定!$C11=\"\",\"\",初期設定!$C11)","v":"理科"},{"$f":"IF(BP3=\"\",\"\",MID(BP3,1,1)&\"偏\")","v":"理偏"},{"$f":"IF(初期設定!$C12=\"\",\"\",初期設定!$C12)","v":"社会"},{"$f":"IF(BR3=\"\",\"\",MID(BR3,1,1)&\"偏\")","v":"社偏"},{"$f":"IF(初期設定!$C13=\"\",\"\",初期設定!$C13)","v":""},{"$f":"IF(BT3=\"\",\"\",MID(BT3,1,1)&\"偏\")","v":""},"2偏","4偏",{"$f":"IF(BL3=\"\",\"\",BL3)","v":"国語"},{"$f":"IF(BM3=\"\",\"\",BM3)","v":"国偏"},"算数","算偏","理科","理偏","社会","社偏","","","2偏","4偏",{"$f":"IF(BX3=\"\",\"\",BX3)","v":"国語"},"国偏","算数","算偏","理科","理偏","社会","社偏","","","2偏","4偏",{"$f":"IF(CJ3=\"\",\"\",CJ3)","v":"国語"},"国偏","算数","算偏","理科","理偏","社会","社偏","","","2偏","4偏",{"$f":"IF(CV3=\"\",\"\",CV3)","v":"国語"},"国偏","算数","算偏","理科","理偏","社会","社偏","","","2偏","4偏",{"$f":"IF(DH3=\"\",\"\",DH3)","v":"国語"},"国偏","算数","算偏","理科","理偏","社会","社偏","","","2偏","4偏",{"$f":"#REF!","v":{"$error":"#REF!"}}]
[1,"6-A","鈴木A男",null,50,97,72,90,25,90,50,97,72,null,null,null,50,97,72,90,25,90,50,97,72,null,null,null,50,97,72,25,25,90,50,97,72,null,null,90,50,12,72,31,60,13,86,66,77,null,null,78,94,10,88,35,27,87,44,17,27,null,null,52,50,35,41,80,60,55,48,null,null,62,61,45,44,90,65,75,59,40,46,null,null,50,55,52,50,35,41,82,66,92,71,null,null,62,61,null,null,null,null,null,null,null,null,null,null,null,null,52,50,35,41,82,66,92,71,null,null,62,61,50,55,60,54,88,62,90,67,null,null,56,55]
[2,"6-A","鈴木B男",11,24,94,22,25,51,55,69,76,35,null,null,86,31,75,64,93,100,47,65,34,16,null,null,48,72,99,40,75,85,95,91,67,75,null,null,10,48,82,42,93,67,70,35,69,88,null,null,24,74,37,44,56,80,64,16,42,77,null,null,null,null,null,null,null,null,null,null,null,null,null,null,50,48,36,30,45,26,71,56,null,null,45,55,null,null,null,null,null,null,null,null,null,null,null,null,50,48,36,30,45,26,71,56,null,null,45,55,null,null,null,null,null,null,null,null,null,null,null,null,50,48,36,30,45,26,71,56,null,null,45,55]
[3,"6-A","鈴木C男",83,23,31,66,70,18,39,15,92,46,null,null,31,12,97,76,32,98,91,28,91,87,null,null,67,64,16,95,53,62,93,96,96,68,null,null,70,90,32,99,34,41,12,45,42,40,null,null,69,100,100,16,80,37,69,36,49,52,null,null,62,58,68,63,57,60,69,59,null,null,61,58,60,54,72,61,80,65,53,56,null,null,61,59,62,58,68,63,57,60,69,59,null,null,61,58,60,54,72,61,80,65,53,56,null,null,61,59,62,58,68,63,57,60,69,59,null,null,61,58,60,54,72,61,80,65,53,56,null,null,61,59]
[4,"6-A","鈴木D男",40,35,20,24,82,96,49,90,45,null,null,null,51,36,71,42,62,88,83,51,60,91,null,null,97,16,91,69,36,97,25,69,32,62,null,null,23,32,56,79,53,81,66,34,35,91,null,null,50,74,66,69,65,40,14,26,98,65,null,null,58,52,77,58,49,60,46,49,null,null,43,13,42,31,56,22,46,45,18,34,null,null,42,58,58,52,77,58,49,60,46,49,null,null,43,13,42,31,56,22,46,45,18,34,null,null,42,58,58,52,77,58,49,60,46,49,null,null,43,13,42,31,56,22,46,45,18,34,null,null,42,58]
[5,"6-A","鈴木E男",56,11,54,100,14,59,80,80,41,36,null,null,100,14,null,87,20,21,48,100,49,18,null,null,59,49,60,48,98,43,35,46,12,16,null,null,77,38,36,86,80,49,54,70,null,84,null,null,91,59,36,67,88,16,85,53,81,86,null,null,38,44,98,66,21,12,12,30,null,null,52,85,19,40,19,35,82,47,56,45,null,null,54,36,38,44,98,66,21,12,12,30,null,null,52,85,19,40,19,35,82,47,56,45,null,null,54,36,38,44,98,66,21,12,12,30,null,null,52,85,19,40,19,35,82,47,56,45,null,null,54,36]
[6,"6-A","鈴木F男",42,21,10,85,18,98,47,69,93,83,null,null,47,82,35,90,68,34,null,22,90,24,null,null,83,75,86,22,35,21,11,32,47,44,null,null,54,39,89,18,null,56,93,36,10,28,null,null,12,14,64,53,null,33,56,69,99,23,null,null,86,66,69,42,14,51,31,42,null,null,47,45,66,54,73,41,12,32,12,42,null,null,63,63,86,66,69,42,14,51,31,42,null,null,47,45,66,54,73,41,12,32,12,42,null,null,63,63,86,66,69,42,14,51,31,42,null,null,47,45,66,54,73,41,12,32,12,42,null,null,63,63]
[7,"6-B","鈴木G男",69,80,51,35,55,11,54,33,88,32,null,null,97,null,85,30,55,98,23,46,26,87,null,null,97,71,28,85,29,83,62,45,null,99,null,null,60,66,38,84,88,47,76,20,52,81,null,null,45,67,92,79,29,67,62,26,null,48,null,null,55,54,72,59,11,21,26,39,null,null,35,15,94,48,97,45,35,41,41,68,null,null,58,44,55,54,72,59,11,21,26,39,null,null,35,15,94,48,97,45,35,41,41,68,null,null,58,44,55,54,72,59,11,21,26,39,null,null,35,15,94,48,97,45,35,41,41,68,null,null,58,44]
{"$rows_left_out":494}
{"sheet":"成績表","index":1,"n_rows":59,"n_cols":18,"rows_kept":59,"cut":false,"hidden":false,"merged":[[30,4,30,5],[60,1,70,19],[43,0,44,0],[33,0,34,0],[35,0,36,0],[37,0,38,0],[39,0,40,0],[41,0,42,0],[44,3,44,4],[43,3,43,4],[42,3,42,4],[41,3,41,4],[35,1,36,1],[39,1,40,1],[39,2,40,2],[43,2,44,2],[43,1,44,1],[40,3,40,4],[35,3,35,4],[37,2,38,2],[41,1,42,1],[41,2,42,2],[39,3,39,4],[38,3,38,4],[0,18,0,19],[1,10,1,13],[37,1,38,1],[35,2,36,2],[33,1,34,1],[33,2,34,2],[37,3,37,4],[30,8,30,10],[34,3,34,4],[33,3,33,4],[32,3,32,4],[36,3,36,4],[30,17,30,19],[2,11,2,13],[1,17,1,20],[31,8,31,10]]}
[]
[null,{"$f":"IF(初期設定!$C2=\"\",\"\",初期設定!$C2)","v":"月例テスト"},null,null,null,null,"ID:",1,{"$f":"IF(VLOOKUP($H2,テストデータ!$A$4:$C503,2,FALSE)=\"\",\"\",VLOOKUP($H2,テストデータ!$A$4:$C503,2,FALSE))","v":"6-A"},"氏名",{"$f":"IF(VLOOKUP($H2,テストデータ!$A$4:$C503,3,FALSE)=\"\",\"\",VLOOKUP($H2,テストデータ!$A$4:$C503,3,FALSE))","v":"鈴木A男"},null,null,null,null,null,null,{"$f":"IF(初期設定!B44=\"\",\"\",初期設定!B44)","v":"微風進学塾"}]
[null,null,null,null,null,null,null,null,null,null,null,{"$f":"IF(初期設定!C1=\"\",\"\",初期設定!C1)","v":"20xx年"}]
[null,{"$f":"IF(初期設定!$C3=\"\",\"\",初期設定!$C3)","v":"国語"},"1回","2回","3回","4回","5回","6回","7回","8回","9回","10回","11回","12回"]
[null,"実施日",{"$f":"IF(テストデータ!D$2=\"\",\"\",テストデータ!D$2)","v":"3/2"},{"$f":"IF(テストデータ!E$2=\"\",\"\",テストデータ!E$2)","v":"4/3"},{"$f":"IF(テストデータ!F$2=\"\",\"\",テストデータ!F$2)","v":"5/4"},{"$f":"IF(テストデータ!G$2=\"\",\"\",テストデータ!G$2)","v":"6/5"},{"$f":"IF(テストデータ!H$2=\"\",\"\",テストデータ!H$2)","v":"7/6"},{"$f":"IF(テストデータ!I$2=\"\",\"\",テストデータ!I$2)","v":"8/7"},{"$f":"IF(テストデータ!J$2=\"\",\"\",テストデータ!J$2)","v":"9/8"},{"$f":"IF(テストデータ!K$2=\"\",\"\",テストデータ!K$2)","v":"10/9"},{"$f":"IF(テストデータ!L$2=\"\",\"\",テストデータ!L$2)","v":"11/10"},{"$f":"IF(テストデータ!M$2=\"\",\"\",テストデータ!M$2)","v":"12/11"},{"$f":"IF(テストデータ!N$2=\"\",\"\",テストデータ!N$2)","v":""},{"$f":"IF(テストデータ!O$2=\"\",\"\",テストデータ!O$2)","v":""}]
[null,"得点",{"$f":"IF(VLOOKUP($H$2,テストデータ!$A$4:$EF$503,4,FALSE)=\"\",IF(INDIRECT(ADDRESS(ROW()-1,COLUMN()))=\"\",\"\",\"欠\"),VLOOKUP($H$2,テストデータ!$A$4:$EF$503,4,FALSE))","v":"欠"},{"$f":"IF(VLOOKUP($H$2,テストデータ!$A$4:$EF$503,5,FALSE)=\"\",IF(INDIRECT(ADDRESS(ROW()-1,COLUMN()))=\"\",\"\",\"欠\"),VLOOKUP($H$2,テストデータ!$A$4:$EF$503,5,FALSE))","v":50},{"$f":"IF(VLOOKUP($H$2,テストデータ!$A$4:$EF$503,6,FALSE)=\"\",IF(INDIRECT(ADDRESS(ROW()-1,COLUMN()))=\"\",\"\",\"欠\"),VLOOKUP($H$2,テストデータ!$A$4:$EF$503,6,FALSE))","v":97},{"$f":"IF(VLOOKUP($H$2,テストデータ!$A$4:$EF$503,7,FALSE)=\"\",IF(INDIRECT(ADDRESS(ROW()-1,COLUMN()))=\"\",\"\",\"欠\"),VLOOKUP($H$2,テストデータ!$A$4:$EF$503,7,FALSE))","v":72},{"$f":"IF(VLOOKUP($H$2,テストデータ!$A$4:$EF$503,8,FALSE)=\"\",IF(INDIRECT(ADDRESS(ROW()-1,COLUMN()))=\"\",\"\",\"欠\"),VLOOKUP($H$2,テストデータ!$A$4:$EF$503,8,FALSE))","v":90},{"$f":"IF(VLOOKUP($H$2,テストデータ!$A$4:$EF$503,9,FALSE)=\"\",IF(INDIRECT(ADDRESS(ROW()-1,COLUMN()))=\"\",\"\",\"欠\"),VLOOKUP($H$2,テストデータ!$A$4:$EF$503,9,FALSE))","v":25},{"$f":"IF(VLOOKUP($H$2,テストデータ!$A$4:$EF$503,10,FALSE)=\"\",IF(INDIRECT(ADDRESS(ROW()-1,COLUMN()))=\"\",\"\",\"欠\"),VLOOKUP($H$2,テストデータ!$A$4:$EF$503,10,FALSE))","v":90},{"$f":"IF(VLOOKUP($H$2,テストデータ!$A$4:$EF$503,11,FALSE)=\"\",IF(INDIRECT(ADDRESS(ROW()-1,COLUMN()))=\"\",\"\",\"欠\"),VLOOKUP($H$2,テストデータ!$A$4:$EF$503,11,FALSE))","v":50},{"$f":"IF(VLOOKUP($H$2,テストデータ!$A$4:$EF$503,12,FALSE)=\"\",IF(INDIRECT(ADDRESS(ROW()-1,COLUMN()))=\"\",\"\",\"欠\"),VLOOKUP($H$2,テストデータ!$A$4:$EF$505,12,FALSE))","v":97},{"$f":"IF(VLOOKUP($H$2,テストデータ!$A$4:$EF$503,13,FALSE)=\"\",IF(INDIRECT(ADDRESS(ROW()-1,COLUMN()))=\"\",\"\",\"欠\"),VLOOKUP($H$2,テストデータ!$A$4:$EF$503,13,FALSE))","v":72},{"$f":"IF(VLOOKUP($H$2,テストデータ!$A$4:$EF$503,14,FALSE)=\"\",IF(INDIRECT(ADDRESS(ROW()-1,COLUMN()))=\"\",\"\",\"欠\"),VLOOKUP($H$2,テストデータ!$A$4:$EF$503,14,FALSE))","v":""},{"$f":"IF(VLOOKUP($H$2,テストデータ!$A$4:$EF$503,15,FALSE)=\"\",IF(INDIRECT(ADDRESS(ROW()-1,COLUMN()))=\"\",\"\",\"欠\"),VLOOKUP($H$2,テストデータ!$A$4:$EF$503,15,FALSE))","v":""}]
[null,"平均点",{"$f":"IF(COUNT(OFFSET(テストデータ!$D$3,1,12*0+0):OFFSET(テストデータ!$D$3,500,12*0+0))=0,NA(),AVERAGE(OFFSET(テストデータ!$D$3,1,12*0+0):OFFSET(テストデータ!$D$3,500,12*0+0)))","v":55.722222222222221},{"$f":"IF(COUNT(OFFSET(テストデータ!$D$3,1,12*0+1):OFFSET(テストデータ!$D$3,500,12*0+1))=0,NA(),AVERAGE(OFFSET(テストデータ!$D$3,1,12*0+1):OFFSET(テストデータ!$D$3,500,12*0+1)))","v":48.35},{"$f":"IF(COUNT(OFFSET(テストデータ!$D$3,1,12*0+2):OFFSET(テストデータ!$D$3,500,12*0+2))=0,NA(),AVERAGE(OFFSET(テストデータ!$D$3,1,12*0+2):OFFSET(テストデータ!$D$3,500,12*0+2)))","v":47},{"$f":"IF(COUNT(OFFSET(テストデータ!$D$3,1,12*0+3):OFFSET(テストデータ!$D$3,500,12*0+3))=0,NA(),AVERAGE(OFFSET(テストデータ!$D$3,1,12*0+3):OFFSET(テストデータ!$D$3,500,12*0+3)))","v":46.7},{"$f":"IF(COUNT(OFFSET(テストデータ!$D$3,1,12*0+4):OFFSET(テストデータ!$D$3,500,12*0+4))=0,NA(),AVERAGE(OFFSET(テストデータ!$D$3,1,12*0+4):OFFSET(テストデータ!$D$3,500,12*0+4)))","v":52.55},{"$f":"IF(COUNT(OFFSET(テストデータ!$D$3,1,12*0+5):OFFSET(テストデータ!$D$3,500,12*0+5))=0,NA(),AVERAGE(OFFSET(テストデータ!$D$3,1,12*0+5):OFFSET(テストデータ!$D$3,500,12*0+5)))","v":52},{"$f":"IF(COUNT(OFFSET(テストデータ!$D$3,1,12*0+6):OFFSET(テストデータ!$D$3,500,12*0+6))=0,NA(),AVERAGE(OFFSET(テストデータ!$D$3,1,12*0+6):OFFSET(テストデータ!$D$3,500,12*0+6)))","v":56.25},{"$f":"IF(COUNT(OFFSET(テストデータ!$D$3,1,12*0+7):OFFSET(テストデータ!$D$3,500,12*0+7))=0,NA(),AVERAGE(OFFSET(テストデータ!$D$3,1,12*0+7):OFFSET(テストデータ!$D$3,500,12*0+7)))","v":61.736842105263158},{"$f":"IF(COUNT(OFFSET(テストデータ!$D$3,1,12*0+8):OFFSET(テストデータ!$D$3,500,12*0+8))=0,NA(),AVERAGE(OFFSET(テストデータ!$D$3,1,12*0+8):OFFSET(テストデータ!$D$3,500,12*0+8)))","v":60.2},{"$f":"IF(COUNT(OFFSET(テストデータ!$D$3,1,12*0+9):OFFSET(テストデータ!$D$3,500,12*0+9))=0,NA(),AVERAGE(OFFSET(テストデータ!$D$3,1,12*0+9):OFFSET(テストデータ!$D$3,500,12*0+9)))","v":52.736842105263158},{"$f":"IF(COUNT(OFFSET(テストデータ!$D$3,1,12*0+10):OFFSET(テストデータ!$D$3,500,12*0+10))=0,NA(),AVERAGE(OFFSET(テストデータ!$D$3,1,12*0+10):OFFSET(テストデータ!$D$3,500,12*0+10)))","v":{"$error":"#N/A"}},{"$f":"IF(COUNT(OFFSET(テストデータ!$D$3,1,12*0+11):OFFSET(テストデータ!$D$3,500,12*0+11))=0,NA(),AVERAGE(OFFSET(テストデータ!$D$3,1,12*0+11):OFFSET(テストデータ!$D$3,500,12*0+11)))","v":{"$error":"#N/A"}}]
[null,"塾内順位",{"$f":"IF(OR(INDIRECT(ADDRESS(ROW()-2,COLUMN()))=\"欠\",INDIRECT(ADDRESS(ROW()-2,COLUMN()))=\"\"),\"\",RANK(INDIRECT(ADDRESS(ROW()-2,COLUMN())),OFFSET(テストデータ!D$3,1,0):OFFSET(テストデータ!D$3,500,0)))","v":""},{"$f":"IF(OR(INDIRECT(ADDRESS(ROW()-2,COLUMN()))=\"欠\",INDIRECT(ADDRESS(ROW()-2,COLUMN()))=\"\"),\"\",RANK(INDIRECT(ADDRESS(ROW()-2,COLUMN())),OFFSET(テストデータ!E$3,1,0):OFFSET(テストデータ!E$3,500,0)))","v":9},{"$f":"IF(OR(INDIRECT(ADDRESS(ROW()-2,COLUMN()))=\"欠\",INDIRECT(ADDRESS(ROW()-2,COLUMN()))=\"\"),\"\",RANK(INDIRECT(ADDRESS(ROW()-2,COLUMN())),OFFSET(テストデータ!F$3,1,0):OFFSET(テストデータ!F$3,500,0)))","v":1},{"$f":"IF(OR(INDIRECT(ADDRESS(ROW()-2,COLUMN()))=\"欠\",INDIRECT(ADDRESS(ROW()-2,COLUMN()))=\"\"),\"\",RANK(INDIRECT(ADDRESS(ROW()-2,COLUMN())),OFFSET(テストデータ!G$3,1,0):OFFSET(テストデータ!G$3,500,0)))","v":6},{"$f":"IF(OR(INDIRECT(ADDRESS(ROW()-2,COLUMN()))=\"欠\",INDIRECT(ADDRESS(ROW()-2,COLUMN()))=\"\"),\"\",RANK(INDIRECT(ADDRESS(ROW()-2,COLUMN())),OFFSET(テストデータ!H$3,1,0):OFFSET(テストデータ!H$3,500,0)))","v":2},{"$f":"IF(OR(INDIRECT(ADDRESS(ROW()-2,COLUMN()))=\"欠\",INDIRECT(ADDRESS(ROW()-2,COLUMN()))=\"\"),\"\",RANK(INDIRECT(ADDRESS(ROW()-2,COLUMN())),OFFSET(テストデータ!I$3,1,0):OFFSET(テストデータ!I$3,500,0)))","v":14},{"$f":"IF(OR(INDIRECT(ADDRESS(ROW()-2,COLUMN()))=\"欠\",INDIRECT(ADDRESS(ROW()-2,COLUMN()))=\"\"),\"\",RANK(INDIRECT(ADDRESS(ROW()-2,COLUMN())),OFFSET(テストデータ!J$3,1,0):OFFSET(テストデータ!J$3,500,0)))","v":2},{"$f":"IF(OR(INDIRECT(ADDRESS(ROW()-2,COLUMN()))=\"欠\",INDIRECT(ADDRESS(ROW()-2,COLUMN()))=\"\"),\"\",RANK(INDIRECT(ADDRESS(ROW()-2,COLUMN())),OFFSET(テストデータ!K$3,1,0):OFFSET(テストデータ!K$3,500,0)))","v":14},{"$f":"IF(OR(INDIRECT(ADDRESS(ROW()-2,COLUMN()))=\"欠\",INDIRECT(ADDRESS(ROW()-2,COLUMN()))=\"\"),\"\",RANK(INDIRECT(ADDRESS(ROW()-2,COLUMN())),OFFSET(テストデータ!L$3,1,0):OFFSET(テストデータ!L$3,500,0)))","v":1},{"$f":"IF(OR(INDIRECT(ADDRESS(ROW()-2,COLUMN()))=\"欠\",INDIRECT(ADDRESS(ROW()-2,COLUMN()))=\"\"),\"\",RANK(INDIRECT(ADDRESS(ROW()-2,COLUMN())),OFFSET(テストデータ!M$3,1,0):OFFSET(テストデータ!M$3,500,0)))","v":6},{"$f":"IF(OR(INDIRECT(ADDRESS(ROW()-2,COLUMN()))=\"欠\",INDIRECT(ADDRESS(ROW()-2,COLUMN()))=\"\"),\"\",RANK(INDIRECT(ADDRESS(ROW()-2,COLUMN())),OFFSET(テストデータ!N$3,1,0):OFFSET(テストデータ!N$3,500,0)))","v":""},{"$f":"IF(OR(INDIRECT(ADDRESS(ROW()-2,COLUMN()))=\"欠\",INDIRECT(ADDRESS(ROW()-2,COLUMN()))=\"\"),\"\",RANK(INDIRECT(ADDRESS(ROW()-2,COLUMN())),OFFSET(テストデータ!O$3,1,0):OFFSET(テストデータ!O$3,500,0)))","v":""}]
[null,{"$f":"IF(初期設定!$C4=\"\",\"\",初期設定!$C4)","v":"算数"},"1回","2回","3回","4回","5回","6回","7回","8回","9回","10回","11回","12回"]
[null,"実施日",{"$f":"IF(テストデータ!P$2=\"\",\"\",テストデータ!P$2)","v":"4/8"},{"$f":"IF(テストデータ!Q$2=\"\",\"\",テストデータ!Q$2)","v":"5/8"},{"$f":"IF(テストデータ!R$2=\"\",\"\",テストデータ!R$2)","v":"6/8"},{"$f":"IF(テストデータ!S$2=\"\",\"\",テストデータ!S$2)","v":"7/8"},{"$f":"IF(テストデータ!T$2=\"\",\"\",テストデータ!T$2)","v":"8/8"},{"$f":"IF(テストデータ!U$2=\"\",\"\",テストデータ!U$2)","v":"9/8"},{"$f":"IF(テストデータ!V$2=\"\",\"\",テストデータ!V$2)","v":"10/8"},{"$f":"IF(テストデータ!W$2=\"\",\"\",テストデータ!W$2)","v":"11/8"},{"$f":"IF(テストデータ!X$2=\"\",\"\",テストデータ!X$2)","v":"12/8"},{"$f":"IF(テストデータ!Y$2=\"\",\"\",テストデータ!Y$2)","v":"1/8"},{"$f":"IF(テストデータ!Z$2=\"\",\"\",テストデータ!Z$2)","v":""},{"$f":"IF(テストデータ!AA$2=\"\",\"\",テストデータ!AA$2)","v":""}]
{"$rows_left_out":50}
{"sheet":"科目別テスト集計","index":2,"n_rows":505,"n_cols":9,"rows_kept":505,"cut":false,"hidden":false,"merged":[[5,7,5,8],[2,1,2,2]]}
[]
[null,{"$f":"IF(初期設定!$C2=\"\",\"\",初期設定!$C2)","v":"月例テスト"}]
[null,"科目：",null,"算数","クラス：","6-A","実施日：","1/8"]
[]
[null,"ID","class","氏名","点数","順位",null,"平均点：","51.3点"]
[null,1,"6-A","鈴木A男",72,{"$f":"IF(E6=\"\",\"\",RANK(E6,$E$6:$E$505))","v":3},null,"クラス別平均点"]
[null,2,"6-A","鈴木B男",16,{"$f":"IF(E7=\"\",\"\",RANK(E7,$E$6:$E$505))","v":6},null,"6-A：","51.3点"]
[null,3,"6-A","鈴木C男",87,2]
[null,4,"6-A","鈴木D男",91,1]
[null,5,"6-A","鈴木E男",18,5]
{"$rows_left_out":496}
{"sheet":"模試・実力テスト集計","index":3,"n_rows":505,"n_cols":9,"rows_kept":505,"cut":false,"hidden":false,"merged":[[2,13,2,14],[2,1,2,2],[5,7,5,8],[1,4,1,6]]}
[]
[null,{"$f":"IF(初期設定!$C8=\"\",\"\",初期設定!$C8)","v":"模擬テスト"}]
[null,"実施：",null,"第２回","科目：","算数","クラス：","全クラス"]
[]
[null,"ID","class","氏名","得点","偏差値","順位","平均点：","60.6点"]
[null,1,"6-A","鈴木A男",90,65,{"$f":"IF(E6=\"\",\"\",RANK(E6,$E$6:$E$505))","v":5},"クラス別平均点"]
[null,2,"6-A","鈴木B男",36,30,{"$f":"IF(E7=\"\",\"\",RANK(E7,$E$6:$E$505))","v":16},"6-A：","57.7点"]
[null,3,"6-A","鈴木C男",72,61,8,"6-B：","64.7点"]
[null,4,"6-A","鈴木D男",56,22,11,"6-C：","59.8点"]
[null,5,"6-A","鈴木E男",19,35,20]
{"$rows_left_out":496}
{"sheet":"連続印刷","index":4,"n_rows":20,"n_cols":11,"rows_kept":20,"cut":false,"hidden":false,"merged":[[3,4,3,7],[3,8,3,9],[7,4,7,6],[7,7,7,9],[7,10,7,13]]}
[]
["ID","class","氏名",null,"●名簿の表示"]
[7,"6-B","鈴木G男"]
[8,"6-B","鈴木H男",null,"印刷するclass：",null,null,null,"6-B",null,"→"]
[9,"6-B","鈴木I男"]
[10,"6-B","鈴木J男",null,"●印刷ページ指定"]
[11,"6-B","鈴木K男"]
[12,"6-B","鈴木L男",null,"成績表シートを",null,null,"1・2ページ両方",null,null," を印刷する"]
[]
[null,null,null,null,"●範囲指定印刷"]
{"$rows_left_out":11}
{"sheet":"初期設定","index":5,"n_rows":44,"n_cols":7,"rows_kept":44,"cut":false,"hidden":false,"merged":[]}
[null,"本年度","20xx年"]
[null,"科目別テスト成績表タイトル","月例テスト"]
[null,"科目1","国語"]
[null,"科目2","算数"]
[null,"科目3","理科"]
[null,"科目4","社会"]
[null,"科目5","英語"]
[null,"模試・実力テスト成績表タイトル","模擬テスト",null,null,"模試","定期"]
[null,"科目1","国語",null,null,{"$f":"IF(C9=\"\",\"\",C9)","v":"国語"},{"$f":"IF(C21=\"\",\"\",C21)","v":"国語"}]
[null,"科目2","算数",null,null,{"$f":"IF(C10=\"\",\"\",C10)","v":"算数"},{"$f":"IF(C22=\"\",\"\",C22)","v":"算数"}]
{"$rows_left_out":34}