{"text_format":"1","workbook":"xlsx","n_sheets":7,"sheets":["テストデータ","成績表","科目別テスト集計","模試・実力テスト集計","定期テスト集計","連続印刷","初期設定"],"not_rendered":{"charts":12,"images":2,"macros":1,"external_links":0,"defined_names":4,"comments":0,"pivot_tables":0},"unopened":[],"bounds":{"document_bytes":16777216,"sheet_cells":100000,"rows_first":2000,"rows_last":500,"rows_between":2000,"halvings":0,"cell_chars":16384,"cell_head_chars":4096},"cells_cut":0,"cells_raw":0,"read":"whole","date_system":"1900"}

{"sheet":"テストデータ","index":0,"n_rows":503,"n_cols":273,"rows_kept":503,"cut":false,"hidden":false,"merged":[[1,267,1,272],[1,203,1,214],[1,223,1,234],[1,249,1,254],[1,255,1,260],[1,261,1,266],[1,243,1,248],[1,215,1,222],[1,235,1,242],[1,183,1,194],[1,115,1,122],[1,135,1,142],[1,155,1,162],[1,175,1,182],[1,123,1,134],[1,143,1,154],[1,163,1,174],[2,51,2,62],[0,51,0,62],[0,89,0,94],[0,83,0,88],[0,69,0,74],[0,63,0,68],[1,63,1,74],[1,83,1,94],[1,75,1,82],[1,103,1,114],[1,95,1,102],[0,215,0,222],[0,235,0,242],[1,195,1,202],[0,163,0,168],[0,169,0,174],[0,195,0,202],[0,183,0,188],[0,189,0,194],[0,223,0,228],[0,229,0,234],[0,203,0,208],[0,209,0,214],[0,103,0,108],[0,109,0,114],[2,15,2,26],[0,3,0,14],[0,15,0,26],[0,27,0,38],[0,39,0,50],[2,3,2,14],[2,27,2,38],[2,39,2,50],[0,249,0,254],[0,255,0,260],[0,261,0,266],[0,267,0,272],[0,243,0,248],[0,0,0,2],[0,115,0,122],[0,135,0,142],[0,155,0,162],[0,175,0,182],[0,123,0,128],[0,129,0,134],[0,143,0,148],[0,149,0,154],[0,75,0,82],[0,95,0,102]]}
["ｶｰｿﾙ方向切り替え",null,null,{"$f":"IF(初期設定!$C2=\"\",\"\",初期設定!$C2)","v":"月例テスト"},null,null,null,null,null,null,null,null,null,null,null,{"$f":"IF(初期設定!$C2=\"\",\"\",初期設定!$C2)","v":"月例テスト"},null,null,null,null,null,null,null,null,null,null,null,{"$f":"IF(初期設定!$C2=\"\",\"\",初期設定!$C2)","v":"月例テスト"},null,null,null,null,null,null,null,null,null,null,null,{"$f":"IF(初期設定!$C2=\"\",\"\",初期設定!$C2)","v":"月例テスト"},null,null,null,null,null,null,null,null,null,null,null,{"$f":"IF(初期設定!$C2=\"\",\"\",初期設定!$C2)","v":"月例テスト"},null,null,null,null,null,null,null,null,null,null,null,"第１回",null,null,null,null,null,"北辰テスト",null,null,null,null,null,null,null,null,null,null,null,null,null,"第２回",null,null,null,null,null,"進研模試",null,null,null,null,null,null,null,null,null,null,null,null,null,"第３回",null,null,null,null,null,"北辰テスト",null,null,null,null,null,null,null,null,null,null,null,null,null,"第４回",null,null,null,null,null,"進研模試",null,null,null,null,null,null,null,null,null,null,null,null,null,"第５回",null,null,null,null,null,"総進模試",null,null,null,null,null,null,null,null,null,null,null,null,null,"第６回",null,null,null,null,null,"北辰テスト",null,null,null,null,null,null,null,null,null,null,null,null,null,"第７回",null,null,null,null,null,"総進模試",null,null,null,null,null,null,null,null,null,null,null,null,null,"第８回",null,null,null,null,null,"北辰テスト",null,null,null,null,null,null,null,null,null,null,null,null,null,"第９回",null,null,null,null,null,"進研模試",null,null,null,null,null,null,null,null,null,null,null,null,null,{"$f":"IF(初期設定!$C26=\"\",\"\",初期設定!$C26)","v":"1学期中間"},null,null,null,null,null,{"$f":"IF(初期設定!$C27=\"\",\"\",初期設定!$C27)","v":"1学期期末"},null,null,null,null,null,{"$f":"IF(初期設定!$C28=\"\",\"\",初期設定!$C28)","v":"2学期中間"},null,null,null,null,null,{"$f":"IF(初期設定!$C29=\"\",\"\",初期設定!$C29)","v":"2学期期末"},null,null,null,null,null,{"$f":"IF(初期設定!$C30=\"\",\"\",初期設定!$C30)","v":"3学期期末"}]
[null,null,"実施日→","3/2","4/3","5/4","6/5","7/6","8/7","9/8","10/9","11/10","12/11",null,null,"4/8","5/8","6/8","7/8","8/8","9/8","10/8","11/8","12/8","1/8",null,null,"4/9","5/12","6/15","7/18","8/5","9/7","10/11","11/30","12/2","1/9",null,null,"4/5","5/2","6/5","7/18","8/5","9/7","10/5","11/30","12/4","1/9",null,null,"4/5","5/2","6/4","7/18","8/10","9/7","10/5","11/21","12/4","1/25",null,null,"4/10",null,null,null,null,null,null,null,null,null,null,null,null,null,null,null,null,null,null,null,"5/11",null,null,null,null,null,null,null,null,null,null,null,null,null,null,null,null,null,null,null,"6/13",null,null,null,null,null,null,null,null,null,null,null,null,null,null,null,null,null,null,null,"7/20",null,null,null,null,null,null,null,null,null,null,null,null,null,null,null,null,null,null,null,"8/25",null,null,null,null,null,null,null,null,null,null,null,null,null,null,null,null,null,null,null,"9/25",null,null,null,null,null,null,null,null,null,null,null,null,null,null,null,null,null,null,null,"10/21",null,null,null,null,null,null,null,null,null,null,null,null,null,null,null,null,null,null,null,"11/3",null,null,null,null,null,null,null,null,null,null,null,null,null,null,null,null,null,null,null,"12/15"]
["ID","class","氏名",{"$f":"IF(初期設定!$C3=\"\",\"\",初期設定!$C3)","v":"英語"},null,null,null,null,null,null,null,null,null,null,null,{"$f":"IF(初期設定!$C4=\"\",\"\",初期設定!$C4)","v":"数学"},null,null,null,null,null,null,null,null,null,null,null,{"$f":"IF(初期設定!$C5=\"\",\"\",初期設定!$C5)","v":"国語"},null,null,null,null,null,null,null,null,null,null,null,{"$f":"IF(初期設定!$C6=\"\",\"\",初期設定!$C6)","v":"社会"},null,null,null,null,null,null,null,null,null,null,null,{"$f":"IF(初期設定!$C7=\"\",\"\",初期設定!$C7)","v":"理科"},null,null,null,null,null,null,null,null,null,null,null,{"$f":"IF(初期設定!$C9=\"\",\"\",初期設定!$C9)","v":"国語"},{"$f":"IF(BL3=\"\",\"\",MID(BL3,1,1)&\"偏\")","v":"国偏"},{"$f":"IF(初期設定!$C10=\"\",\"\",初期設定!$C10)","v":"英語"},{"$f":"IF(BN3=\"\",\"\",MID(BN3,1,1)&\"偏\")","v":"英偏"},{"$f":"IF(初期設定!$C11=\"\",\"\",初期設定!$C11)","v":"数学"},{"$f":"IF(BP3=\"\",\"\",MID(BP3,1,1)&\"偏\")","v":"数偏"},{"$f":"IF(初期設定!$C12=\"\",\"\",初期設定!$C12)","v":"社会"},{"$f":"IF(BR3=\"\",\"\",MID(BR3,1,1)&\"偏\")","v":"社偏"},{"$f":"IF(初期設定!$C13=\"\",\"\",初期設定!$C13)","v":"理科"},{"$f":"IF(BT3=\"\",\"\",MID(BT3,1,1)&\"偏\")","v":"理偏"},"３偏","５偏","志望校 公立1","判定","志望校 公立2","判定","志望校 私立1","判定","志望校 私立2","判定",{"$f":"IF(BL3=\"\",\"\",BL3)","v":"国語"},{"$f":"IF(BM3=\"\",\"\",BM3)","v":"国偏"},"英語","英偏","数学","数偏","社会","社偏","理科","理偏","３偏","５偏","志望校 公立1","判定","志望校 公立2","判定","志望校 私立1","判定","志望校 私立2","判定",{"$f":"IF(CF3=\"\",\"\",CF3)","v":"国語"},"国偏","英語","英偏","数学","数偏","社会","社偏","理科","理偏","３偏","５偏","志望校 公立1","判定","志望校 公立2","判定","志望校 私立1","判定","志望校 私立2","判定",{"$f":"IF(CZ3=\"\",\"\",CZ3)","v":"国語"},"国偏","英語","英偏","数学","数偏","社会","社偏","理科","理偏","３偏","５偏","志望校 公立1","判定","志望校 公立2","判定","志望校 私立1","判定","志望校 私立2","判定",{"$f":"IF(DT3=\"\",\"\",DT3)","v":"国語"},"国偏","英語","英偏","数学","数偏","社会","社偏","理科","理偏","３偏","５偏","志望校 公立1","判定","志望校 公立2","判定","志望校 私立1","判定","志望校 私立2","判定",{"$f":"IF(EN3=\"\",\"\",EN3)","v":"国語"},"国偏","英語","英偏","数学","数偏","社会","社偏","理科","理偏","３偏","５偏","志望校 公立1","判定","志望校 公立2","判定","志望校 私立1","判定","志望校 私立2","判定",{"$f":"IF(FH3=\"\",\"\",FH3)","v":"国語"},{"$f":"IF(FI3=\"\",\"\",FI3)","v":"国偏"},{"$f":"IF(FJ3=\"\",\"\",FJ3)","v":"英語"},{"$f":"IF(FK3=\"\",\"\",FK3)","v":"英偏"},{"$f":"IF(FL3=\"\",\"\",FL3)","v":"数学"},{"$f":"IF(FM3=\"\",\"\",FM3)","v":"数偏"},{"$f":"IF(FN3=\"\",\"\",FN3)","v":"社会"},{"$f":"IF(FO3=\"\",\"\",FO3)","v":"社偏"},{"$f":"IF(FP3=\"\",\"\",FP3)","v":"理科"},{"$f":"IF(FQ3=\"\",\"\",FQ3)","v":"理偏"},"３偏","５偏","志望校 公立1","判定","志望校 公立2","判定","志望校 私立1","判定","志望校 私立2","判定",{"$f":"IF(GB3=\"\",\"\",GB3)","v":"国語"},{"$f":"IF(GC3=\"\",\"\",GC3)","v":"国偏"},{"$f":"IF(GD3=\"\",\"\",GD3)","v":"英語"},{"$f":"IF(GE3=\"\",\"\",GE3)","v":"英偏"},{"$f":"IF(GF3=\"\",\"\",GF3)","v":"数学"},{"$f":"IF(GG3=\"\",\"\",GG3)","v":"数偏"},{"$f":"IF(GH3=\"\",\"\",GH3)","v":"社会"},{"$f":"IF(GI3=\"\",\"\",GI3)","v":"社偏"},{"$f":"IF(GJ3=\"\",\"\",GJ3)","v":"理科"},{"$f":"IF(GK3=\"\",\"\",GK3)","v":"理偏"},"３偏","５偏","志望校 公立1","判定","志望校 公立2","判定","志望校 私立1","判定","志望校 私立2","判定",{"$f":"IF(GV3=\"\",\"\",GV3)","v":"国語"},{"$f":"IF(GW3=\"\",\"\",GW3)","v":"国偏"},{"$f":"IF(GX3=\"\",\"\",GX3)","v":"英語"},{"$f":"IF(GY3=\"\",\"\",GY3)","v":"英偏"},{"$f":"IF(GZ3=\"\",\"\",GZ3)","v":"数学"},{"$f":"IF(HA3=\"\",\"\",HA3)","v":"数偏"},{"$f":"IF(HB3=\"\",\"\",HB3)","v":"社会"},{"$f":"IF(HC3=\"\",\"\",HC3)","v":"社偏"},{"$f":"IF(HD3=\"\",\"\",HD3)","v":"理科"},{"$f":"IF(HE3=\"\",\"\",HE3)","v":"理偏"},"３偏","５偏","志望校 公立1","判定","志望校 公立2","判定","志望校 私立1","判定","志望校 私立2","判定",{"$f":"IF(初期設定!$C21=\"\",\"\",初期設定!$C21)","v":"国語"},{"$f":"IF(初期設定!$C22=\"\",\"\",初期設定!$C22)","v":"英語"},{"$f":"IF(初期設定!$C23=\"\",\"\",初期設定!$C23)","v":"数学"},{"$f":"IF(初期設定!$C24=\"\",\"\",初期設定!$C24)","v":"社会"},{"$f":"IF(初期設定!$C25=\"\",\"\",初期設定!$C25)","v":"理科"},"順位",{"$f":"IJ3","v":"国語"},{"$f":"IK3","v":"英語"},{"$f":"IL3","v":"数学"},{"$f":"IM3","v":"社会"},{"$f":"IN3","v":"理科"},"順位",{"$f":"IP3","v":"国語"},{"$f":"IQ3","v":"英語"},{"$f":"IR3","v":"数学"},{"$f":"IS3","v":"社会"},{"$f":"IT3","v":"理科"},"順位",{"$f":"IV3","v":"国語"},{"$f":"IW3","v":"英語"},{"$f":"IX3","v":"数学"},{"$f":"IY3","v":"社会"},{"$f":"IZ3","v":"理科"},"順位",{"$f":"JB3","v":"国語"},{"$f":"JC3","v":"英語"},{"$f":"JD3","v":"数学"},{"$f":"JE3","v":"社会"},{"$f":"JF3","v":"理科"},"順位"]
[1,"3-1","鈴木A男",null,50,97,72,90,25,90,50,97,72,null,null,null,50,97,72,90,25,90,50,97,72,null,null,null,50,97,72,25,25,90,50,97,72,null,null,90,50,12,72,31,60,13,86,66,23,null,null,78,94,10,88,35,27,87,44,17,27,null,null,52,50,35,41,82,66,92,71,79,61,62,61,"県立千葉","E","千葉東","D","渋谷幕張","C","成田","B",81,65,21,73,67,20,77,46,22,19,54,40,"県立千葉","E","千葉東","D","渋谷幕張","C","成田","B",52,50,35,41,82,66,92,71,79,61,62,61,"県立千葉","E","千葉東","D","渋谷幕張","C","成田","B",null,null,null,null,null,null,null,null,null,null,null,null,"県立千葉","E","千葉東","D","渋谷幕張","C","成田","B",52,50,35,41,82,66,92,71,79,61,62,61,"県立千葉","E","千葉東","D","渋谷幕張","C","成田","B",83,33,94,67,46,58,35,12,54,23,23,45,"県立千葉","E","千葉東","D","渋谷幕張","C","成田","B",83,33,94,67,46,58,35,12,54,23,23,45,"県立千葉","E","千葉東","D","渋谷幕張","C","成田","B",null,null,null,null,null,null,null,null,null,null,null,null,"県立千葉","E","千葉東","D","渋谷幕張","C","成田","B",83,33,94,67,46,58,35,12,54,23,23,45,"県立千葉","E","千葉東","D","渋谷幕張","C","成田","B",36,58,41,92,88,21,53,89,90,23,89,15,36,58,41,92,88,21,53,89,90,23,89,15]
[2,"3-1","鈴木B男",11,24,94,22,25,51,55,69,76,35,null,null,86,31,75,64,93,100,47,65,34,16,null,null,48,72,99,40,75,85,95,91,67,75,null,null,10,48,82,42,93,67,70,35,69,77,null,null,24,74,37,44,56,80,64,16,42,77,null,null,60,56,92,60,65,38,57,78,16,50,45,47,"千葉東","C","千葉西","A","市川","A","千葉明徳","F",50,48,36,30,45,26,71,56,60,26,45,55,"千葉東","C","千葉西","A","市川","A","千葉明徳","F",null,null,null,null,null,null,null,null,null,null,null,null,"千葉東","C","千葉西","A","市川","A","千葉明徳","F",50,48,36,30,45,26,71,56,60,26,45,55,"千葉東","C","千葉西","A","市川","A","千葉明徳","F",null,null,null,null,null,null,null,null,null,null,null,null,"千葉東","C","千葉西","A","市川","A","千葉明徳","F",50,48,36,30,45,99,68,56,60,26,45,55,"千葉東","C","千葉西","A","市川","A","千葉明徳","F",50,48,36,30,45,26,71,56,60,26,45,55,"千葉東","C","千葉西","A","市川","A","千葉明徳","F",50,48,36,30,45,26,71,56,60,26,45,55,"千葉東","C","千葉西","A","市川","A","千葉明徳","F",50,48,36,30,45,26,71,56,60,26,45,55,"千葉東","C","千葉西","A","市川","A","千葉明徳","F",null,null,null,null,null,null,62,95,67,82,38,28,null,null,null,null,null,150,62,95,67,82,38,28]
[3,"3-1","鈴木C男",83,23,31,66,70,18,39,15,92,46,null,null,31,12,97,76,32,98,91,28,91,87,null,null,67,64,16,95,53,62,93,96,96,68,null,null,70,90,32,99,34,41,12,45,42,40,null,null,69,100,100,16,80,37,69,36,49,52,null,null,62,58,68,63,57,60,69,59,58,55,61,58,"県立千葉","E","千葉東","D","渋谷幕張","C","成田","B",60,54,72,61,80,65,53,56,83,60,61,59,"県立千葉","E","千葉東","D","渋谷幕張","C","成田","B",62,58,68,63,57,60,69,59,58,55,61,58,"県立千葉","E","千葉東","D","渋谷幕張","C","成田","B",55,54,72,61,80,65,53,56,83,60,61,59,"県立千葉","E","千葉東","D","渋谷幕張","C","成田","B",69,58,68,63,57,60,69,59,58,55,61,58,"県立千葉","E","千葉東","D","渋谷幕張","C","成田","B",88,54,72,61,80,65,53,56,83,60,61,59,"県立千葉","E","千葉東","D","渋谷幕張","C","成田","B",77,54,72,61,80,65,53,56,83,60,61,59,"県立千葉","E","千葉東","D","渋谷幕張","C","成田","B",74,54,72,61,80,65,53,56,83,60,61,59,"県立千葉","E","千葉東","D","渋谷幕張","C","成田","B",45,54,72,61,80,65,53,56,83,60,61,59,"県立千葉","E","千葉東","D","渋谷幕張","C","成田","B",93,41,23,48,53,51,42,92,88,83,51,36,93,41,23,48,53,51,42,92,88,83,51,36]
[4,"3-1","鈴木D男",40,35,20,24,82,96,49,90,45,null,null,null,51,36,71,42,62,88,83,51,60,91,null,null,97,16,91,69,36,97,25,69,32,62,null,null,23,32,56,79,53,81,66,34,35,91,null,null,50,74,66,69,65,40,14,26,98,65,null,null,58,52,77,58,49,60,46,49,78,58,43,13,"県立千葉","B","千葉西","A","成田","E","千葉経済","D",42,31,56,22,46,45,18,34,98,68,42,58,"県立千葉","B","千葉西","A","成田","E","千葉経済","D",58,52,77,58,49,60,46,49,78,58,43,13,"県立千葉","B","千葉西","A","成田","E","千葉経済","D",42,31,56,22,46,45,18,34,98,68,42,58,"県立千葉","B","千葉西","A","成田","E","千葉経済","D",58,52,77,58,49,60,46,49,78,58,43,13,"県立千葉","B","千葉西","A","成田","E","千葉経済","D",42,31,56,22,46,45,18,34,98,68,42,58,"県立千葉","B","千葉西","A","成田","E","千葉経済","D",42,31,56,22,46,45,18,34,98,68,42,58,"県立千葉","B","千葉西","A","成田","E","千葉経済","D",42,31,56,22,46,45,18,34,98,68,42,58,"県立千葉","B","千葉西","A","成田","E","千葉経済","D",42,31,56,22,46,45,18,34,98,68,42,58,"県立千葉","B","千葉西","A","成田","E","千葉経済","D",39,97,27,55,56,54,31,93,31,36,13,85,39,97,27,55,56,54,31,93,31,36,13,85]
[5,"3-1","鈴木E男",56,11,54,100,14,59,80,80,41,36,null,null,100,14,null,87,20,21,48,100,49,18,null,null,59,49,60,48,98,43,35,46,12,16,null,null,77,38,36,86,80,49,54,70,null,84,null,null,91,59,36,67,88,16,85,53,81,86,null,null,38,44,98,66,21,12,12,30,33,21,52,85,"千葉西","C","千葉南","C","成田","C","成田","C",19,40,19,35,82,47,56,45,50,47,54,36,"千葉西","C","千葉南","C","成田","C","成田","C",38,44,98,66,21,12,12,30,33,21,52,85,"千葉西","C","千葉南","C","成田","C","成田","C",19,40,19,35,82,47,56,45,50,47,54,36,"千葉西","C","千葉南","C","成田","C","成田","C",38,44,98,66,21,12,12,30,33,21,52,85,"千葉西","C","千葉南","C","成田","C","成田","C",19,40,19,35,82,47,56,45,50,47,54,36,"千葉西","C","千葉南","C","成田","C","成田","C",19,40,19,35,82,47,56,45,50,47,54,36,"千葉西","C","千葉南","C","成田","C","成田","C",19,40,19,35,82,47,56,45,50,47,54,36,"千葉西","C","千葉南","C","成田","C","成田","C",19,40,19,35,82,47,56,45,50,47,54,36,"千葉西","C","千葉南","C","成田","C","成田","C",null,47,98,96,null,21,64,88,64,97,91,45,null,47,98,96,null,21,64,88,64,97,91,45]
{"$rows_left_out":496}
{"sheet":"成績表","index":1,"n_rows":67,"n_cols":22,"rows_kept":67,"cut":false,"hidden":false,"merged":[[30,1,30,3],[30,11,30,14],[60,1,60,5],[30,18,30,19],[0,18,0,19],[1,10,1,13],[37,1,38,1],[35,2,36,2],[33,1,34,1],[33,2,34,2],[37,3,37,4],[34,3,34,4],[33,3,33,4],[32,3,32,4],[36,3,36,4],[32,12,32,15],[32,17,32,20],[43,2,44,2],[43,1,44,1],[40,3,40,4],[35,3,35,4],[37,2,38,2],[41,1,42,1],[44,12,44,15],[66,1,66,2],[41,2,42,2],[35,1,36,1],[39,1,40,1],[39,2,40,2],[43,0,44,0],[61,1,61,2],[62,1,62,2],[47,0,48,0],[49,0,50,0],[63,1,63,2],[64,1,64,2],[65,1,65,2],[51,0,51,2],[43,3,43,4],[45,0,46,0],[45,3,45,4],[46,3,46,4],[45,1,46,1],[45,2,46,2],[44,3,44,4],[34,12,34,15],[35,12,35,15],[36,12,36,15],[39,3,39,4],[38,3,38,4],[42,3,42,4],[41,3,41,4],[33,0,34,0],[35,0,36,0],[37,0,38,0],[39,0,40,0],[41,0,42,0],[33,12,33,15],[37,12,37,15],[38,12,38,15],[0,20,0,23],[30,20,30,23],[1,17,1,18],[47,17,47,20],[48,17,48,20],[49,17,49,20],[50,17,50,20],[48,12,48,15],[49,12,49,15],[50,12,50,15],[47,12,47,15],[42,17,42,20],[43,17,43,20],[44,17,44,20],[45,17,45,20],[43,12,43,15],[46,17,46,20],[46,12,46,15],[45,12,45,15],[39,12,39,15],[40,12,40,15],[41,12,41,15],[42,12,42,15],[33,17,33,20],[51,4,51,6],[51,8,51,10],[51,12,51,14],[51,16,51,18],[51,20,51,22],[1,1,1,3],[2,10,2,13],[1,19,1,22],[50,3,50,4],[49,1,50,1],[49,2,50,2],[47,3,47,4],[48,3,48,4],[49,3,49,4],[47,1,48,1],[47,2,48,2],[34,17,34,20],[35,17,35,20],[36,17,36,20],[37,17,37,20],[38,17,38,20],[39,17,39,20],[40,17,40,20],[41,17,41,20]]}
[]
[null,{"$f":"IF(初期設定!$C2=\"\",\"\",初期設定!$C2)","v":"月例テスト"},null,null,null,null,"ID:",1,{"$f":"IF(VLOOKUP($H2,テストデータ!$A$4:$C503,2,FALSE)=\"\",\"\",VLOOKUP($H2,テストデータ!$A$4:$C503,2,FALSE))","v":"3-1"},"氏名",{"$f":"IF(VLOOKUP($H2,テストデータ!$A$4:$C503,3,FALSE)=\"\",\"\",VLOOKUP($H2,テストデータ!$A$4:$C503,3,FALSE))","v":"鈴木A男"},null,null,null,null,null,null,null,null,{"$f":"初期設定!B44","v":"微風進学塾"}]
[null,null,null,null,null,null,null,null,null,null,{"$f":"IF(初期設定!C1=\"\",\"\",初期設定!C1)","v":"20xx年度"}]
[null,{"$f":"IF(初期設定!$C3=\"\",\"\",初期設定!$C3)","v":"英語"},"1回","2回","3回","4回","5回","6回","7回","8回","9回","10回","11回","12回"]
[null,"実施日",{"$f":"IF(テストデータ!D$2=\"\",\"\",テストデータ!D$2)","v":"3/2"},{"$f":"IF(テストデータ!E$2=\"\",\"\",テストデータ!E$2)","v":"4/3"},{"$f":"IF(テストデータ!F$2=\"\",\"\",テストデータ!F$2)","v":"5/4"},{"$f":"IF(テストデータ!G$2=\"\",\"\",テストデータ!G$2)","v":"6/5"},{"$f":"IF(テストデータ!H$2=\"\",\"\",テストデータ!H$2)","v":"7/6"},{"$f":"IF(テストデータ!I$2=\"\",\"\",テストデータ!I$2)","v":"8/7"},{"$f":"IF(テストデータ!J$2=\"\",\"\",テストデータ!J$2)","v":"9/8"},{"$f":"IF(テストデータ!K$2=\"\",\"\",テストデータ!K$2)","v":"10/9"},{"$f":"IF(テストデータ!L$2=\"\",\"\",テストデータ!L$2)","v":"11/10"},{"$f":"IF(テストデータ!M$2=\"\",\"\",テストデータ!M$2)","v":"12/11"},{"$f":"IF(テストデータ!N$2=\"\",\"\",テストデータ!N$2)","v":""},{"$f":"IF(テストデータ!O$2=\"\",\"\",テストデータ!O$2)","v":""}]
[null,"得点",{"$f":"IF(VLOOKUP($H$2,テストデータ!$A$4:$JL$503,4,FALSE)=\"\",IF(INDIRECT(ADDRESS(ROW()-1,COLUMN()))=\"\",\"\",\"欠\"),VLOOKUP($H$2,テストデータ!$A$4:$JL$503,4,FALSE))","v":"欠"},{"$f":"IF(VLOOKUP($H$2,テストデータ!$A$4:$JL$503,5,FALSE)=\"\",IF(INDIRECT(ADDRESS(ROW()-1,COLUMN()))=\"\",\"\",\"欠\"),VLOOKUP($H$2,テストデータ!$A$4:$JL$503,5,FALSE))","v":50},{"$f":"IF(VLOOKUP($H$2,テストデータ!$A$4:$JL$503,6,FALSE)=\"\",IF(INDIRECT(ADDRESS(ROW()-1,COLUMN()))=\"\",\"\",\"欠\"),VLOOKUP($H$2,テストデータ!$A$4:$JL$503,6,FALSE))","v":97},{"$f":"IF(VLOOKUP($H$2,テストデータ!$A$4:$JL$503,7,FALSE)=\"\",IF(INDIRECT(ADDRESS(ROW()-1,COLUMN()))=\"\",\"\",\"欠\"),VLOOKUP($H$2,テストデータ!$A$4:$JL$503,7,FALSE))","v":72},{"$f":"IF(VLOOKUP($H$2,テストデータ!$A$4:$JL$503,8,FALSE)=\"\",IF(INDIRECT(ADDRESS(ROW()-1,COLUMN()))=\"\",\"\",\"欠\"),VLOOKUP($H$2,テストデータ!$A$4:$JL$503,8,FALSE))","v":90},{"$f":"IF(VLOOKUP($H$2,テストデータ!$A$4:$JL$503,9,FALSE)=\"\",IF(INDIRECT(ADDRESS(ROW()-1,COLUMN()))=\"\",\"\",\"欠\"),VLOOKUP($H$2,テストデータ!$A$4:$JL$503,9,FALSE))","v":25},{"$f":"IF(VLOOKUP($H$2,テストデータ!$A$4:$JL$503,10,FALSE)=\"\",IF(INDIRECT(ADDRESS(ROW()-1,COLUMN()))=\"\",\"\",\"欠\"),VLOOKUP($H$2,テストデータ!$A$4:$JL$503,10,FALSE))","v":90},{"$f":"IF(VLOOKUP($H$2,テストデータ!$A$4:$JL$503,11,FALSE)=\"\",IF(INDIRECT(ADDRESS(ROW()-1,COLUMN()))=\"\",\"\",\"欠\"),VLOOKUP($H$2,テストデータ!$A$4:$JL$503,11,FALSE))","v":50},{"$f":"IF(VLOOKUP($H$2,テストデータ!$A$4:$JL$503,12,FALSE)=\"\",IF(INDIRECT(ADDRESS(ROW()-1,COLUMN()))=\"\",\"\",\"欠\"),VLOOKUP($H$2,テストデータ!$A$4:$JL$503,12,FALSE))","v":97},{"$f":"IF(VLOOKUP($H$2,テストデータ!$A$4:$JL$503,13,FALSE)=\"\",IF(INDIRECT(ADDRESS(ROW()-1,COLUMN()))=\"\",\"\",\"欠\"),VLOOKUP($H$2,テストデータ!$A$4:$JL$503,13,FALSE))","v":72},{"$f":"IF(VLOOKUP($H$2,テストデータ!$A$4:$JL$503,14,FALSE)=\"\",IF(INDIRECT(ADDRESS(ROW()-1,COLUMN()))=\"\",\"\",\"欠\"),VLOOKUP($H$2,テストデータ!$A$4:$JL$503,14,FALSE))","v":""},{"$f":"IF(VLOOKUP($H$2,テストデータ!$A$4:$JL$503,15,FALSE)=\"\",IF(INDIRECT(ADDRESS(ROW()-1,COLUMN()))=\"\",\"\",\"欠\"),VLOOKUP($H$2,テストデータ!$A$4:$JL$503,15,FALSE))","v":""}]
[null,"平均点",{"$f":"IF(COUNT(OFFSET(テストデータ!$D$3,1,12*0+0):OFFSET(テストデータ!$D$3,500,12*0+0))=0,NA(),AVERAGE(OFFSET(テストデータ!$D$3,1,12*0+0):OFFSET(テストデータ!$D$3,500,12*0+0)))","v":55.722222222222221},{"$f":"IF(COUNT(OFFSET(テストデータ!$D$3,1,12*0+1):OFFSET(テストデータ!$D$3,500,12*0+1))=0,NA(),AVERAGE(OFFSET(テストデータ!$D$3,1,12*0+1):OFFSET(テストデータ!$D$3,500,12*0+1)))","v":48.35},{"$f":"IF(COUNT(OFFSET(テストデータ!$D$3,1,12*0+2):OFFSET(テストデータ!$D$3,500,12*0+2))=0,NA(),AVERAGE(OFFSET(テストデータ!$D$3,1,12*0+2):OFFSET(テストデータ!$D$3,500,12*0+2)))","v":47},{"$f":"IF(COUNT(OFFSET(テストデータ!$D$3,1,12*0+3):OFFSET(テストデータ!$D$3,500,12*0+3))=0,NA(),AVERAGE(OFFSET(テストデータ!$D$3,1,12*0+3):OFFSET(テストデータ!$D$3,500,12*0+3)))","v":46.7},{"$f":"IF(COUNT(OFFSET(テストデータ!$D$3,1,12*0+4):OFFSET(テストデータ!$D$3,500,12*0+4))=0,NA(),AVERAGE(OFFSET(テストデータ!$D$3,1,12*0+4):OFFSET(テストデータ!$D$3,500,12*0+4)))","v":52.55},{"$f":"IF(COUNT(OFFSET(テストデータ!$D$3,1,12*0+5):OFFSET(テストデータ!$D$3,500,12*0+5))=0,NA(),AVERAGE(OFFSET(テストデータ!$D$3,1,12*0+5):OFFSET(テストデータ!$D$3,500,12*0+5)))","v":52},{"$f":"IF(COUNT(OFFSET(テストデータ!$D$3,1,12*0+6):OFFSET(テストデータ!$D$3,500,12*0+6))=0,NA(),AVERAGE(OFFSET(テストデータ!$D$3,1,12*0+6):OFFSET(テストデータ!$D$3,500,12*0+6)))","v":56.25},{"$f":"IF(COUNT(OFFSET(テストデータ!$D$3,1,12*0+7):OFFSET(テストデータ!$D$3,500,12*0+7))=0,NA(),AVERAGE(OFFSET(テストデータ!$D$3,1,12*0+7):OFFSET(テストデータ!$D$3,500,12*0+7)))","v":61.736842105263158},{"$f":"IF(COUNT(OFFSET(テストデータ!$D$3,1,12*0+8):OFFSET(テストデータ!$D$3,500,12*0+8))=0,NA(),AVERAGE(OFFSET(テストデータ!$D$3,1,12*0+8):OFFSET(テストデータ!$D$3,500,12*0+8)))","v":60.2},{"$f":"IF(COUNT(OFFSET(テストデータ!$D$3,1,12*0+9):OFFSET(テストデータ!$D$3,500,12*0+9))=0,NA(),AVERAGE(OFFSET(テストデータ!$D$3,1,12*0+9):OFFSET(テストデータ!$D$3,500,12*0+9)))","v":52.736842105263158},{"$f":"IF(COUNT(OFFSET(テストデータ!$D$3,1,12*0+10):OFFSET(テストデータ!$D$3,500,12*0+10))=0,NA(),AVERAGE(OFFSET(テストデータ!$D$3,1,12*0+10):OFFSET(テストデータ!$D$3,500,12*0+10)))","v":{"$error":"#N/A"}},{"$f":"IF(COUNT(OFFSET(テストデータ!$D$3,1,12*0+11):OFFSET(テストデータ!$D$3,500,12*0+11))=0,NA(),AVERAGE(OFFSET(テストデータ!$D$3,1,12*0+11):OFFSET(テストデータ!$D$3,500,12*0+11)))","v":{"$error":"#N/A"}}]
[null,"塾内順位",{"$f":"IF(OR(INDIRECT(ADDRESS(ROW()-2,COLUMN()))=\"欠\",INDIRECT(ADDRESS(ROW()-2,COLUMN()))=\"\"),\"\",RANK(INDIRECT(ADDRESS(ROW()-2,COLUMN())),OFFSET(テストデータ!D$3,1,0):OFFSET(テストデータ!D$3,500,0)))","v":""},{"$f":"IF(OR(INDIRECT(ADDRESS(ROW()-2,COLUMN()))=\"欠\",INDIRECT(ADDRESS(ROW()-2,COLUMN()))=\"\"),\"\",RANK(INDIRECT(ADDRESS(ROW()-2,COLUMN())),OFFSET(テストデータ!E$3,1,0):OFFSET(テストデータ!E$3,500,0)))","v":9},{"$f":"IF(OR(INDIRECT(ADDRESS(ROW()-2,COLUMN()))=\"欠\",INDIRECT(ADDRESS(ROW()-2,COLUMN()))=\"\"),\"\",RANK(INDIRECT(ADDRESS(ROW()-2,COLUMN())),OFFSET(テストデータ!F$3,1,0):OFFSET(テストデータ!F$3,500,0)))","v":1},{"$f":"IF(OR(INDIRECT(ADDRESS(ROW()-2,COLUMN()))=\"欠\",INDIRECT(ADDRESS(ROW()-2,COLUMN()))=\"\"),\"\",RANK(INDIRECT(ADDRESS(ROW()-2,COLUMN())),OFFSET(テストデータ!G$3,1,0):OFFSET(テストデータ!G$3,500,0)))","v":6},{"$f":"IF(OR(INDIRECT(ADDRESS(ROW()-2,COLUMN()))=\"欠\",INDIRECT(ADDRESS(ROW()-2,COLUMN()))=\"\"),\"\",RANK(INDIRECT(ADDRESS(ROW()-2,COLUMN())),OFFSET(テストデータ!H$3,1,0):OFFSET(テストデータ!H$3,500,0)))","v":2},{"$f":"IF(OR(INDIRECT(ADDRESS(ROW()-2,COLUMN()))=\"欠\",INDIRECT(ADDRESS(ROW()-2,COLUMN()))=\"\"),\"\",RANK(INDIRECT(ADDRESS(ROW()-2,COLUMN())),OFFSET(テストデータ!I$3,1,0):OFFSET(テストデータ!I$3,500,0)))","v":14},{"$f":"IF(OR(INDIRECT(ADDRESS(ROW()-2,COLUMN()))=\"欠\",INDIRECT(ADDRESS(ROW()-2,COLUMN()))=\"\"),\"\",RANK(INDIRECT(ADDRESS(ROW()-2,COLUMN())),OFFSET(テストデータ!J$3,1,0):OFFSET(テストデータ!J$3,500,0)))","v":2},{"$f":"IF(OR(INDIRECT(ADDRESS(ROW()-2,COLUMN()))=\"欠\",INDIRECT(ADDRESS(ROW()-2,COLUMN()))=\"\"),\"\",RANK(INDIRECT(ADDRESS(ROW()-2,COLUMN())),OFFSET(テストデータ!K$3,1,0):OFFSET(テストデータ!K$3,500,0)))","v":14},{"$f":"IF(OR(INDIRECT(ADDRESS(ROW()-2,COLUMN()))=\"欠\",INDIRECT(ADDRESS(ROW()-2,COLUMN()))=\"\"),\"\",RANK(INDIRECT(ADDRESS(ROW()-2,COLUMN())),OFFSET(テストデータ!L$3,1,0):OFFSET(テストデータ!L$3,500,0)))","v":1},{"$f":"IF(OR(INDIRECT(ADDRESS(ROW()-2,COLUMN()))=\"欠\",INDIRECT(ADDRESS(ROW()-2,COLUMN()))=\"\"),\"\",RANK(INDIRECT(ADDRESS(ROW()-2,COLUMN())),OFFSET(テストデータ!M$3,1,0):OFFSET(テストデータ!M$3,500,0)))","v":6},{"$f":"IF(OR(INDIRECT(ADDRESS(ROW()-2,COLUMN()))=\"欠\",INDIRECT(ADDRESS(ROW()-2,COLUMN()))=\"\"),\"\",RANK(INDIRECT(ADDRESS(ROW()-2,COLUMN())),OFFSET(テストデータ!N$3,1,0):OFFSET(テストデータ!N$3,500,0)))","v":""},{"$f":"IF(OR(INDIRECT(ADDRESS(ROW()-2,COLUMN()))=\"欠\",INDIRECT(ADDRESS(ROW()-2,COLUMN()))=\"\"),\"\",RANK(INDIRECT(ADDRESS(ROW()-2,COLUMN())),OFFSET(テストデータ!O$3,1,0):OFFSET(テストデータ!O$3,500,0)))","v":""}]
{"$rows_left_out":60}
{"sheet":"科目別テスト集計","index":2,"n_rows":505,"n_cols":9,"rows_kept":505,"cut":false,"hidden":false,"merged":[[5,7,5,8],[2,1,2,2],[1,1,1,3]]}
[]
[null,{"$f":"IF(初期設定!$C2=\"\",\"\",初期設定!$C2)","v":"月例テスト"}]
[null,"科目：",null,"英語","クラス：","全クラス","実施日：","12/11"]
[]
[null,"ID","class","氏名","得点","順位",null,"平均点：","52.7点"]
[null,1,"3-1","鈴木A男",72,{"$f":"IF(E6=\"\",\"\",RANK(E6,$E$6:$E$505))","v":6},null,"クラス別平均点"]
[null,2,"3-1","鈴木B男",35,{"$f":"IF(E7=\"\",\"\",RANK(E7,$E$6:$E$505))","v":13}]
[null,3,"3-1","鈴木C男",46,10]
{"$rows_left_out":498}
{"sheet":"模試・実力テスト集計","index":3,"n_rows":505,"n_cols":9,"rows_kept":505,"cut":false,"hidden":false,"merged":[[2,13,2,14],[2,1,2,2],[5,7,5,8],[1,4,1,6],[1,1,1,3]]}
[]
[null,{"$f":"IF(初期設定!$C8=\"\",\"\",初期設定!$C8)","v":"模擬試験"},null,null,"第１回北辰テスト"]
[null,"実施：",null,"第１回","科目：","国語","クラス：","全クラス"]
[]
[null,"ID","class","氏名","得点","偏差値","順位","平均点：","58.6点"]
[null,1,"3-1","鈴木A男",52,50,{"$f":"IF(E6=\"\",\"\",RANK(E6,$E$6:$E$505))","v":14},"クラス別平均点"]
[null,2,"3-1","鈴木B男",60,56,{"$f":"IF(E7=\"\",\"\",RANK(E7,$E$6:$E$505))","v":8}]
[null,3,"3-1","鈴木C男",62,58,7]
{"$rows_left_out":498}
{"sheet":"定期テスト集計","index":4,"n_rows":25,"n_cols":9,"rows_kept":25,"cut":false,"hidden":false,"merged":[[2,1,2,2],[2,13,2,14],[5,7,5,8],[1,4,1,6],[1,1,1,3]]}
[]
[null,{"$f":"IF(初期設定!$C20=\"\",\"\",初期設定!$C20)","v":"定期テスト"},null,null,"1学期中間"]
[null,"実施：",null,"第１回","科目：","国語","クラス：","全クラス"]
[]
[null,"ID","class","氏名","得点",null,null,"平均点：","57.5点"]
[null,1,"3-1","鈴木A男",36,null,null,"クラス別平均点"]
[null,2,"3-1","鈴木B男"]
[null,3,"3-1","鈴木C男",93]
{"$rows_left_out":18}
{"sheet":"連続印刷","index":5,"n_rows":20,"n_cols":11,"rows_kept":20,"cut":false,"hidden":false,"merged":[[7,10,7,13],[3,4,3,7],[3,8,3,9],[7,7,7,9],[7,4,7,6]]}
[]
["ID","class","氏名",null,"●名簿の表示"]
[]
[null,null,null,null,"印刷するclass：",null,null,null,"A",null,"→"]
[]
[null,null,null,null,"●印刷ページ指定"]
[]
[null,null,null,null,"成績表シートを",null,null,"1ページのみ",null,null," を印刷する"]
{"$rows_left_out":13}
{"sheet":"初期設定","index":6,"n_rows":44,"n_cols":7,"rows_kept":44,"cut":false,"hidden":false,"merged":[[0,3,0,4]]}
[null,"本年度","20xx年度","模試志望校入力用"]
[null,"科目別テスト成績表タイトル","月例テスト","公立高校","私立高校"]
[null,"科目1","英語"]
[null,"科目2","数学"]
[null,"科目3","国語"]
[null,"科目4","社会"]
[null,"科目5","理科"]
[null,"模試・実力テスト成績表タイトル","模擬試験",null,null,"模試","定期"]
{"$rows_left_out":36}